Target
Alkaline phosphatase, germ cell type
Ligand
BDBM4339
Substrate
Meas. Tech.
Dose Response confirmation of uHTS inhibitors of Mouse Intestinal Alkaline Phosphatase using Placental Alkaline Phosphatase
IC50
>100000±n/a nM
Citation
 PubChem, PC Dose Response confirmation of uHTS inhibitors of Mouse Intestinal Alkaline Phosphatase using Placental Alkaline Phosphatase PubChem Bioassay (2010)[AID] 
Target
Name:
Alkaline phosphatase, germ cell type
Synonyms:
ALPG ALPPL2 PPBN_HUMAN | placental-like alkaline phosphatase preproprotein
Type:
PROTEIN
Mol. Mass.:
57374.31
Organism:
Homo sapiens (Human)
Description:
ChEMBL_29964
Residue:
532
  
Inhibitor
Name:
BDBM4339
Synonyms:
(3,4-Dihydroxybenzylidene)malononitrile benzylidenemalononitrile (BMN) deriv. 23 | cid_2052
Type:
Small organic molecule
Emp. Form.:
C10H6N2O2
Mol. Mass.:
186.1668
SMILES:
[#8]-c1ccc(\[#6]=[#6](/C#N)C#N)cc1-[#8]
: