Target
Alkaline phosphatase, tissue-nonspecific isozyme
Ligand
BDBM52378
Substrate
Meas. Tech.
Dose Response confirmation of uHTS activators of Mouse Intestinal Alkaline Phosphatase using Tissue Nonspecific Alkaline Phosphatase.
EC50
40400±n/a nM
Citation
 PubChem, PC Dose Response confirmation of uHTS activators of Mouse Intestinal Alkaline Phosphatase using Tissue Nonspecific Alkaline Phosphatase. PubChem Bioassay (2010)[AID] 
Target
Name:
Alkaline phosphatase, tissue-nonspecific isozyme
Synonyms:
ALPL tissue-nonspecific alkaline phosphatase precursor
Type:
PROTEIN
Mol. Mass.:
57306.17
Organism:
Homo sapiens (Human)
Description:
ChEMBL_1448917
Residue:
524
  
Inhibitor
Name:
BDBM52378
Synonyms:
MLS000546183 N-(2-cyanoethyl)-N-[[5-[(E)-[1-(4-methylphenyl)-4,6-bis(oxidanylidene)-2-sulfanylidene-1,3-diazinan-5-ylidene]methyl]furan-2-yl]methyl]methanesulfonamide N-(2-cyanoethyl)-N-[[5-[(E)-[1-(4-methylphenyl)-4,6-dioxo-2-sulfanylidene-1,3-diazinan-5-ylidene]methyl]furan-2-yl]methyl]methanesulfonamide SMR000162492 | cid_1814301
Type:
Small organic molecule
Emp. Form.:
C21H20N4O5S2
Mol. Mass.:
472.537
SMILES:
Cc1ccc(cc1)N1C(=S)NC(=O)C(=Cc2ccc(CN(CCC#N)S(C)(=O)=O)o2)C1=O
: