Target
DNA (cytosine-5)-methyltransferase 3A
Ligand
BDBM46243
Substrate
Meas. Tech.
SAR Selectivity Analysis of small molecule inhibitors of PEST using pCAP in a fluorescence assay
IC50
5080±n/a nM
Citation
 PubChem, PC SAR Selectivity Analysis of small molecule inhibitors of PEST using pCAP in a fluorescence assay PubChem Bioassay (2010)[AID] 
Target
Name:
DNA (cytosine-5)-methyltransferase 3A
Synonyms:
DNA (cytosine-5)-methyltransferase 3A DNA methyltransferase HsaIIIA DNMT3A M.HsaIIIA | tyrosine-protein phosphatase non-receptor type 12 isoform 2
Type:
PROTEIN
Mol. Mass.:
101857.24
Organism:
Homo sapiens (Human)
Description:
ChEMBL_1510405
Residue:
912
  
Inhibitor
Name:
BDBM46243
Synonyms:
4-[[2-chloranyl-4-[(E)-2-cyano-2-(3-fluorophenyl)ethenyl]-6-ethoxy-phenoxy]methyl]benzoic acid 4-[[2-chloro-4-[(E)-2-cyano-2-(3-fluorophenyl)vinyl]-6-ethoxy-phenoxy]methyl]benzoic acid cid_2230267
Type:
Small organic molecule
Emp. Form.:
C25H19ClFNO4
Mol. Mass.:
451.874
SMILES:
CCOc1cc(\C=C(\C#N)c2cccc(F)c2)cc(Cl)c1OCc1ccc(cc1)C(O)=O
: