Target
DNA (cytosine-5)-methyltransferase 3A
Ligand
BDBM61243
Substrate
Meas. Tech.
SAR Selectivity Analysis of small molecule inhibitors of PEST using pCAP in a fluorescence assay
IC50
2600±n/a nM
Citation
 PubChem, PC SAR Selectivity Analysis of small molecule inhibitors of PEST using pCAP in a fluorescence assay PubChem Bioassay (2010)[AID] 
Target
Name:
DNA (cytosine-5)-methyltransferase 3A
Synonyms:
DNA (cytosine-5)-methyltransferase 3A DNA methyltransferase HsaIIIA DNMT3A M.HsaIIIA | tyrosine-protein phosphatase non-receptor type 12 isoform 2
Type:
PROTEIN
Mol. Mass.:
101857.24
Organism:
Homo sapiens (Human)
Description:
ChEMBL_1510405
Residue:
912
  
Inhibitor
Name:
BDBM61243
Synonyms:
3-[[(E)-3-[4-(4-chlorobenzyl)oxy-3-methoxy-phenyl]-2-cyano-acryloyl]amino]benzoic acid 3-[[(E)-3-[4-[(4-chlorophenyl)methoxy]-3-methoxyphenyl]-2-cyano-1-oxoprop-2-enyl]amino]benzoic acid MLS001172702 cid_1516221
Type:
Small organic molecule
Emp. Form.:
C25H19ClN2O5
Mol. Mass.:
462.882
SMILES:
COc1cc(\C=C(/C#N)C(=O)Nc2cccc(c2)C(O)=O)ccc1OCc1ccc(Cl)cc1
: