Target
Alkaline phosphatase, tissue-nonspecific isozyme
Ligand
BDBM75661
Substrate
Meas. Tech.
Dose Response confirmation of uHTS activators of Human Intestinal Alkaline Phosphatase using Tissue Nonspecific Alkaline Phosphatase.
EC50
14100±n/a nM
Citation
 PubChem, PC Dose Response confirmation of uHTS activators of Human Intestinal Alkaline Phosphatase using Tissue Nonspecific Alkaline Phosphatase. PubChem Bioassay (2010)[AID] 
Target
Name:
Alkaline phosphatase, tissue-nonspecific isozyme
Synonyms:
ALPL tissue-nonspecific alkaline phosphatase precursor
Type:
PROTEIN
Mol. Mass.:
57306.17
Organism:
Homo sapiens (Human)
Description:
ChEMBL_1448917
Residue:
524
  
Inhibitor
Name:
BDBM75661
Synonyms:
4-[(2-methyl-[1,2,4]triazolo[1,5-c]quinazolin-5-yl)hydrazo]-4-oxo-N-[2-(4-phenyl-1-piperazinyl)ethyl]butanamide 4-[2-(2-methyl-[1,2,4]triazolo[1,5-c]quinazolin-5-yl)hydrazinyl]-4-oxo-N-[2-(4-phenylpiperazin-1-yl)ethyl]butanamide MLS000924746 cid_24789597
Type:
Small organic molecule
Emp. Form.:
C26H31N9O2
Mol. Mass.:
501.5834
SMILES:
Cc1nc2c3ccccc3nc(NNC(=O)CCC(=O)NCCN3CCN(CC3)c3ccccc3)n2n1
: