Target
Alkaline phosphatase, germ cell type
Ligand
BDBM75613
Substrate
Meas. Tech.
Dose Response confirmation of uHTS activators of Human Intestinal Alkaline Phosphatase using Placental Alkaline Phosphatase
EC50
1910±n/a nM
Citation
 PubChem, PC Dose Response confirmation of uHTS activators of Human Intestinal Alkaline Phosphatase using Placental Alkaline Phosphatase PubChem Bioassay (2010)[AID] 
Target
Name:
Alkaline phosphatase, germ cell type
Synonyms:
ALPG ALPPL2 PPBN_HUMAN | placental-like alkaline phosphatase preproprotein
Type:
PROTEIN
Mol. Mass.:
57374.31
Organism:
Homo sapiens (Human)
Description:
ChEMBL_29964
Residue:
532
  
Inhibitor
Name:
BDBM75613
Synonyms:
(2Z)-9-(3-chlorophenyl)-2-(5-ethoxy-6-keto-cyclohexa-2,4-dien-1-ylidene)-8-keto-1,7-dihydropurine-6-carboxamide (2Z)-9-(3-chlorophenyl)-2-(5-ethoxy-6-oxo-1-cyclohexa-2,4-dienylidene)-8-oxo-1,7-dihydropurine-6-carboxamide MLS000102658 cid_6324587
Type:
Small organic molecule
Emp. Form.:
C20H16ClN5O4
Mol. Mass.:
425.825
SMILES:
CCOc1cccc(c1O)-c1nc(C(N)=O)c2[nH]c(=O)n(-c3cccc(Cl)c3)c2n1
: