Target
Alkaline phosphatase, germ cell type
Ligand
BDBM75634
Substrate
Meas. Tech.
Dose Response confirmation of uHTS activators of Human Intestinal Alkaline Phosphatase using Placental Alkaline Phosphatase
EC50
12300±n/a nM
Citation
 PubChem, PC Dose Response confirmation of uHTS activators of Human Intestinal Alkaline Phosphatase using Placental Alkaline Phosphatase PubChem Bioassay (2010)[AID] 
Target
Name:
Alkaline phosphatase, germ cell type
Synonyms:
ALPG ALPPL2 PPBN_HUMAN | placental-like alkaline phosphatase preproprotein
Type:
PROTEIN
Mol. Mass.:
57374.31
Organism:
Homo sapiens (Human)
Description:
ChEMBL_29964
Residue:
532
  
Inhibitor
Name:
BDBM75634
Synonyms:
2-(8-amino-9H-[1,2,4]triazolo[1,5-d][1,2,4]triazepin-5-yl)-5-(2-methoxyphenyl)-3-(trifluoromethyl)-2-pyrazolin-3-ol 2-(8-azanyl-9H-[1,2,4]triazolo[1,5-d][1,2,4]triazepin-5-yl)-5-(2-methoxyphenyl)-3-(trifluoromethyl)-4H-pyrazol-3-ol SMR000287148 | cid_5103621
Type:
Small organic molecule
Emp. Form.:
C16H15F3N8O2
Mol. Mass.:
408.3379
SMILES:
COc1ccccc1C1=NN(C2=NN=C(N)Cc3ncnn23)C(O)(C1)C(F)(F)F
: