Target
Alkaline phosphatase, germ cell type
Ligand
BDBM75657
Substrate
Meas. Tech.
Dose Response confirmation of uHTS activators of Human Intestinal Alkaline Phosphatase using Placental Alkaline Phosphatase
EC50
64200±n/a nM
Citation
 PubChem, PC Dose Response confirmation of uHTS activators of Human Intestinal Alkaline Phosphatase using Placental Alkaline Phosphatase PubChem Bioassay (2010)[AID] 
Target
Name:
Alkaline phosphatase, germ cell type
Synonyms:
ALPG ALPPL2 PPBN_HUMAN | placental-like alkaline phosphatase preproprotein
Type:
PROTEIN
Mol. Mass.:
57374.31
Organism:
Homo sapiens (Human)
Description:
ChEMBL_29964
Residue:
532
  
Inhibitor
Name:
BDBM75657
Synonyms:
1-[[1-(2-chlorobenzyl)-4-piperidyl]methyl]-3-(3,4,5-trimethoxyphenyl)urea 1-[[1-[(2-chlorophenyl)methyl]piperidin-4-yl]methyl]-3-(3,4,5-trimethoxyphenyl)urea N-{[1-(2-chlorobenzyl)piperidin-4-yl]methyl}-N'-(3,4,5-trimethoxyphenyl)urea cid_15989538
Type:
Small organic molecule
Emp. Form.:
C23H30ClN3O4
Mol. Mass.:
447.955
SMILES:
COc1cc(NC(=O)NCC2CCN(Cc3ccccc3Cl)CC2)cc(OC)c1OC
: