Target
Alkaline phosphatase, germ cell type
Ligand
BDBM75698
Substrate
Meas. Tech.
Dose Response confirmation of uHTS activators of Human Intestinal Alkaline Phosphatase using Placental Alkaline Phosphatase
EC50
14700±n/a nM
Citation
 PubChem, PC Dose Response confirmation of uHTS activators of Human Intestinal Alkaline Phosphatase using Placental Alkaline Phosphatase PubChem Bioassay (2010)[AID] 
Target
Name:
Alkaline phosphatase, germ cell type
Synonyms:
ALPG ALPPL2 PPBN_HUMAN | placental-like alkaline phosphatase preproprotein
Type:
PROTEIN
Mol. Mass.:
57374.31
Organism:
Homo sapiens (Human)
Description:
ChEMBL_29964
Residue:
532
  
Inhibitor
Name:
BDBM75698
Synonyms:
MLS002161453 N-(1H-benzimidazol-2-yl)-2-[(4-bromophenyl)sulfonylamino]propanamide cid_16284837
Type:
Small organic molecule
Emp. Form.:
C16H15BrN4O3S
Mol. Mass.:
423.284
SMILES:
CC(NS(=O)(=O)c1ccc(Br)cc1)C(=O)Nc1nc2ccccc2[nH]1
: