Target
Alkaline phosphatase, germ cell type
Ligand
BDBM39629
Substrate
Meas. Tech.
Dose Response confirmation of uHTS inhibitors of Human Intestinal Alkaline Phosphatase using Placental Alkaline Phosphatase
IC50
>100000±n/a nM
Citation
 PubChem, PC Dose Response confirmation of uHTS inhibitors of Human Intestinal Alkaline Phosphatase using Placental Alkaline Phosphatase PubChem Bioassay (2010)[AID] 
Target
Name:
Alkaline phosphatase, germ cell type
Synonyms:
ALPG ALPPL2 PPBN_HUMAN | placental-like alkaline phosphatase preproprotein
Type:
PROTEIN
Mol. Mass.:
57374.31
Organism:
Homo sapiens (Human)
Description:
ChEMBL_29964
Residue:
532
  
Inhibitor
Name:
BDBM39629
Synonyms:
4-[3-(3-pyridinyl)-1H-1,2,4-triazol-5-yl]-4-azatricyclo[5.2.1.0~2,6~]dec-8-ene-3,5-dione SMR000081093 | cid_2972795
Type:
Small organic molecule
Emp. Form.:
C16H13N5O2
Mol. Mass.:
307.3067
SMILES:
[H]C12CC([H])(C=C1)C1C2C(=O)N(C1=O)c1n[nH]c(n1)-c1cccnc1
: