Target
Caspase-3
Ligand
BDBM76433
Substrate
Meas. Tech.
Dose Response confirmation of inhibitors of Sentrin-specific proteases (SENPs) using a Caspase-3 Selectivity assay
IC50
4220±n/a nM
Citation
 PubChem, PC Dose Response confirmation of inhibitors of Sentrin-specific proteases (SENPs) using a Caspase-3 Selectivity assay PubChem Bioassay (2010)[AID] 
Target
Name:
Caspase-3
Synonyms:
Apopain CASP3 CPP-32 Caspase 3 Caspase-3 subunit p17 SCA-1 Yama protein | caspase-3 preproprotein
Type:
Hydrolase; heterotetramer of two heterodimers
Mol. Mass.:
31607.55
Organism:
Homo sapiens (Human)
Description:
Residue:
277
  
Inhibitor
Name:
BDBM76433
Synonyms:
2-[3-(6-Methyl-1H-benzoimidazol-2-yl)-pyridin-2-ylsulfanyl]-1-(2-methyl-2,3-dihydro-indol-1-yl)-ethanone 2-[[3-(6-methyl-1H-benzimidazol-2-yl)-2-pyridinyl]thio]-1-(2-methyl-2,3-dihydroindol-1-yl)ethanone MLS000557795 cid_3231085
Type:
Small organic molecule
Emp. Form.:
C24H22N4OS
Mol. Mass.:
414.523
SMILES:
CC1Cc2ccccc2N1C(=O)CSc1ncccc1-c1nc2ccc(C)cc2[nH]1
: