Target
Caspase-3
Ligand
BDBM64796
Substrate
Meas. Tech.
Dose Response confirmation of inhibitors of Sentrin-specific proteases (SENPs) using a Caspase-3 Selectivity assay
IC50
94500±n/a nM
Citation
 PubChem, PC Dose Response confirmation of inhibitors of Sentrin-specific proteases (SENPs) using a Caspase-3 Selectivity assay PubChem Bioassay (2010)[AID] 
Target
Name:
Caspase-3
Synonyms:
Apopain CASP3 CPP-32 Caspase 3 Caspase-3 subunit p17 SCA-1 Yama protein | caspase-3 preproprotein
Type:
Hydrolase; heterotetramer of two heterodimers
Mol. Mass.:
31607.55
Organism:
Homo sapiens (Human)
Description:
Residue:
277
  
Inhibitor
Name:
BDBM64796
Synonyms:
MLS000861878 N-(2-hydroxy-1,3-dioxo-2-indenyl)-4-(trifluoromethyl)benzamide N-[2-oxidanyl-1,3-bis(oxidanylidene)inden-2-yl]-4-(trifluoromethyl)benzamide SMR000460662 | cid_2732881
Type:
Small organic molecule
Emp. Form.:
C17H10F3NO4
Mol. Mass.:
349.2608
SMILES:
OC1(NC(=O)c2ccc(cc2)C(F)(F)F)C(=O)c2ccccc2C1=O
: