Target
Epidermal growth factor receptor [T790M,L858R]
Ligand
BDBM270538
Substrate
Meas. Tech.
TBD
IC50
7.52±n/a nM
Citation
 Hu, SLiu, XBai, JLong, W Protein tyrosine kinase modulators and methods of use US Patent  US10059688 Publication Date 8/28/2018 
Target
Name:
Epidermal growth factor receptor [T790M,L858R]
Synonyms:
EGFR EGFR_HUMAN ERBB1 Epidermal growth factor receptor (EGFR)(T790M/L858R) Epidermal growth factor receptor (T790M, L858R) Epidermal growth factor receptor(L858R, T790M) | HER1
Type:
Mol. Mass.:
134353.72
Organism:
Homo sapiens (Human)
Description:
P00533[T790M,L858R]
Residue:
1210
  
Inhibitor
Name:
BDBM270538
Synonyms:
US10059688, Example 4 | US9783524, Example 4
Type:
Small organic molecule
Emp. Form.:
C26H30ClN7O3
Mol. Mass.:
524.015
SMILES:
COc1cc(ccc1Nc1ncc(Cl)c(Nc2ccccc2C(=O)C(N)=O)n1)N1CCC(CC1)N(C)C
: