Target
Sentrin-specific protease 8
Ligand
BDBM34901
Substrate
Meas. Tech.
Dose Response confirmation of uHTS for inhibitors of Sentrin-specific protease 8 (SENP8) using a Luminescent assay
IC50
2410±n/a nM
Citation
 PubChem, PC Dose Response confirmation of uHTS for inhibitors of Sentrin-specific protease 8 (SENP8) using a Luminescent assay PubChem Bioassay (2010)[AID] 
Target
Name:
Sentrin-specific protease 8
Synonyms:
DEN1 PRSC2 SENP8_HUMAN | SUMO/sentrin specific peptidase family member 8
Type:
Enzyme Catalytic Domain
Mol. Mass.:
24104.52
Organism:
Homo sapiens (Human)
Description:
gi_262118306
Residue:
212
  
Inhibitor
Name:
BDBM34901
Synonyms:
1,1-diisopropyl-3-piazthiol-5-yl-urea MLS000764665 cid_1072934
Type:
Small organic molecule
Emp. Form.:
C13H18N4OS
Mol. Mass.:
278.373
SMILES:
CC(C)N(C(C)C)C(=O)Nc1ccc2nsnc2c1
: