Target
Sentrin-specific protease 8
Ligand
BDBM76662
Substrate
Meas. Tech.
Dose Response confirmation of uHTS for inhibitors of Sentrin-specific protease 8 (SENP8) using a Luminescent assay
IC50
21000±n/a nM
Citation
 PubChem, PC Dose Response confirmation of uHTS for inhibitors of Sentrin-specific protease 8 (SENP8) using a Luminescent assay PubChem Bioassay (2010)[AID] 
Target
Name:
Sentrin-specific protease 8
Synonyms:
DEN1 PRSC2 SENP8_HUMAN | SUMO/sentrin specific peptidase family member 8
Type:
Enzyme Catalytic Domain
Mol. Mass.:
24104.52
Organism:
Homo sapiens (Human)
Description:
gi_262118306
Residue:
212
  
Inhibitor
Name:
BDBM76662
Synonyms:
4-methyl-7-phenylmethoxy-1-benzopyran-2-one 4-methyl-7-phenylmethoxychromen-2-one 7-benzoxy-4-methyl-coumarin SMR000514539 | cid_728520
Type:
Small organic molecule
Emp. Form.:
C17H14O3
Mol. Mass.:
266.2913
SMILES:
Cc1cc(=O)oc2cc(OCc3ccccc3)ccc12
: