Target
Alkaline phosphatase, tissue-nonspecific isozyme
Ligand
BDBM50648
Substrate
Meas. Tech.
Dose Response confirmation of uHTS inhibitors of Mouse Intestinal Alkaline Phosphatase using Tissue Nonspecific Alkaline Phosphatase.
IC50
>100000±n/a nM
Citation
 PubChem, PC Dose Response confirmation of uHTS inhibitors of Mouse Intestinal Alkaline Phosphatase using Tissue Nonspecific Alkaline Phosphatase. PubChem Bioassay (2010)[AID] 
Target
Name:
Alkaline phosphatase, tissue-nonspecific isozyme
Synonyms:
ALPL tissue-nonspecific alkaline phosphatase precursor
Type:
PROTEIN
Mol. Mass.:
57306.17
Organism:
Homo sapiens (Human)
Description:
ChEMBL_1448917
Residue:
524
  
Inhibitor
Name:
BDBM50648
Synonyms:
MLS000762704 N-[(5Z)-5-[(E)-3-(2-furyl)prop-2-enylidene]-4-keto-2-thioxo-thiazolidin-3-yl]isonicotinamide N-[(5Z)-5-[(E)-3-(furan-2-yl)prop-2-enylidene]-4-oxo-2-sulfanylidene-1,3-thiazolidin-3-yl]pyridine-4-carboxamide SMR000438207 | cid_5922856
Type:
Small organic molecule
Emp. Form.:
C16H11N3O3S2
Mol. Mass.:
357.407
SMILES:
O=C(NN1C(=S)S\C(=C/C=C/c2ccco2)C1=O)c1ccncc1
: