Target
Alkaline phosphatase, tissue-nonspecific isozyme
Ligand
BDBM52942
Substrate
Meas. Tech.
Dose Response confirmation of uHTS inhibitors of Mouse Intestinal Alkaline Phosphatase using Tissue Nonspecific Alkaline Phosphatase.
IC50
>100000±n/a nM
Citation
 PubChem, PC Dose Response confirmation of uHTS inhibitors of Mouse Intestinal Alkaline Phosphatase using Tissue Nonspecific Alkaline Phosphatase. PubChem Bioassay (2010)[AID] 
Target
Name:
Alkaline phosphatase, tissue-nonspecific isozyme
Synonyms:
ALPL tissue-nonspecific alkaline phosphatase precursor
Type:
PROTEIN
Mol. Mass.:
57306.17
Organism:
Homo sapiens (Human)
Description:
ChEMBL_1448917
Residue:
524
  
Inhibitor
Name:
BDBM52942
Synonyms:
3-(3,4-dihydroxyphenethyl)-2-thioxoimidazolidin-4-one 3-[2-(3,4-dihydroxyphenyl)ethyl]-2-sulfanylideneimidazolidin-4-one 3-[2-[3,4-bis(oxidanyl)phenyl]ethyl]-2-sulfanylidene-imidazolidin-4-one SMR000456717 | cid_2726660
Type:
Small organic molecule
Emp. Form.:
C11H12N2O3S
Mol. Mass.:
252.29
SMILES:
Oc1ccc(CCN2C(=O)CNC2=S)cc1O
: