Target
Alkaline phosphatase, tissue-nonspecific isozyme
Ligand
BDBM52946
Substrate
Meas. Tech.
Dose Response confirmation of uHTS inhibitors of Mouse Intestinal Alkaline Phosphatase using Tissue Nonspecific Alkaline Phosphatase.
IC50
>100000±n/a nM
Citation
 PubChem, PC Dose Response confirmation of uHTS inhibitors of Mouse Intestinal Alkaline Phosphatase using Tissue Nonspecific Alkaline Phosphatase. PubChem Bioassay (2010)[AID] 
Target
Name:
Alkaline phosphatase, tissue-nonspecific isozyme
Synonyms:
ALPL tissue-nonspecific alkaline phosphatase precursor
Type:
PROTEIN
Mol. Mass.:
57306.17
Organism:
Homo sapiens (Human)
Description:
ChEMBL_1448917
Residue:
524
  
Inhibitor
Name:
BDBM52946
Synonyms:
2-(3,4-dihydroxyphenyl)acetic acid 3,4-Dihydroxyphenylacetate, XV MLS001056737 cid_547
Type:
Small organic molecule
Emp. Form.:
C8H8O4
Mol. Mass.:
168.1467
SMILES:
OC(=O)Cc1ccc(O)c(O)c1
: