Target
Alkaline phosphatase, tissue-nonspecific isozyme
Ligand
BDBM76209
Substrate
Meas. Tech.
Dose Response confirmation of uHTS inhibitors of Mouse Intestinal Alkaline Phosphatase using Tissue Nonspecific Alkaline Phosphatase.
IC50
>100000±n/a nM
Citation
 PubChem, PC Dose Response confirmation of uHTS inhibitors of Mouse Intestinal Alkaline Phosphatase using Tissue Nonspecific Alkaline Phosphatase. PubChem Bioassay (2010)[AID] 
Target
Name:
Alkaline phosphatase, tissue-nonspecific isozyme
Synonyms:
ALPL tissue-nonspecific alkaline phosphatase precursor
Type:
PROTEIN
Mol. Mass.:
57306.17
Organism:
Homo sapiens (Human)
Description:
ChEMBL_1448917
Residue:
524
  
Inhibitor
Name:
BDBM76209
Synonyms:
MLS001072569 N-[3-(3-chlorophenyl)phenyl]-1-[(1,5-dimethylpyrazol-4-yl)methyl]isonipecotamide SMR000654172 | cid_24790275
Type:
Small organic molecule
Emp. Form.:
C24H27ClN4O
Mol. Mass.:
422.95
SMILES:
Cc1c(CN2CCC(CC2)C(=O)Nc2cccc(c2)-c2cccc(Cl)c2)cnn1C
: