Target
Alkaline phosphatase, tissue-nonspecific isozyme
Ligand
BDBM75676
Substrate
Meas. Tech.
Dose Response confirmation of uHTS inhibitors of Mouse Intestinal Alkaline Phosphatase using Tissue Nonspecific Alkaline Phosphatase.
IC50
23400±n/a nM
Citation
 PubChem, PC Dose Response confirmation of uHTS inhibitors of Mouse Intestinal Alkaline Phosphatase using Tissue Nonspecific Alkaline Phosphatase. PubChem Bioassay (2010)[AID] 
Target
Name:
Alkaline phosphatase, tissue-nonspecific isozyme
Synonyms:
ALPL tissue-nonspecific alkaline phosphatase precursor
Type:
PROTEIN
Mol. Mass.:
57306.17
Organism:
Homo sapiens (Human)
Description:
ChEMBL_1448917
Residue:
524
  
Inhibitor
Name:
BDBM75676
Synonyms:
1-[(1-ethyl-3,5-dimethyl-4-pyrazolyl)methyl]-N-[3-(3-fluorophenyl)phenyl]-4-piperidinecarboxamide 1-[(1-ethyl-3,5-dimethyl-pyrazol-4-yl)methyl]-N-[3-(3-fluorophenyl)phenyl]piperidine-4-carboxamide MLS001072215 cid_24816657
Type:
Small organic molecule
Emp. Form.:
C26H31FN4O
Mol. Mass.:
434.5489
SMILES:
CCn1nc(C)c(CN2CCC(CC2)C(=O)Nc2cccc(c2)-c2cccc(F)c2)c1C
: