Target
Alkaline phosphatase, tissue-nonspecific isozyme
Ligand
BDBM76233
Substrate
Meas. Tech.
Dose Response confirmation of uHTS inhibitors of Mouse Intestinal Alkaline Phosphatase using Tissue Nonspecific Alkaline Phosphatase.
IC50
>100000±n/a nM
Citation
 PubChem, PC Dose Response confirmation of uHTS inhibitors of Mouse Intestinal Alkaline Phosphatase using Tissue Nonspecific Alkaline Phosphatase. PubChem Bioassay (2010)[AID] 
Target
Name:
Alkaline phosphatase, tissue-nonspecific isozyme
Synonyms:
ALPL tissue-nonspecific alkaline phosphatase precursor
Type:
PROTEIN
Mol. Mass.:
57306.17
Organism:
Homo sapiens (Human)
Description:
ChEMBL_1448917
Residue:
524
  
Inhibitor
Name:
BDBM76233
Synonyms:
KG-SM SMR001231151 | cid_24983199
Type:
Small organic molecule
Emp. Form.:
C60H103N17O8S
Mol. Mass.:
1222.634
SMILES:
CSCC[C@H](C(=O)NCCCCCCCCCCC(=O)N1CCN(CC1)c1nc(NCCOCCOCCOCC#C)nc(n1)N1CCN(CC1)C(=O)CCCCCCCCCCNC(=O)Cn1cc(CCCCCN)nn1)n1cc(CCO)nn1
: