Target
Alkaline phosphatase, tissue-nonspecific isozyme
Ligand
BDBM76243
Substrate
Meas. Tech.
Dose Response confirmation of uHTS inhibitors of Mouse Intestinal Alkaline Phosphatase using Tissue Nonspecific Alkaline Phosphatase.
IC50
>100000±n/a nM
Citation
 PubChem, PC Dose Response confirmation of uHTS inhibitors of Mouse Intestinal Alkaline Phosphatase using Tissue Nonspecific Alkaline Phosphatase. PubChem Bioassay (2010)[AID] 
Target
Name:
Alkaline phosphatase, tissue-nonspecific isozyme
Synonyms:
ALPL tissue-nonspecific alkaline phosphatase precursor
Type:
PROTEIN
Mol. Mass.:
57306.17
Organism:
Homo sapiens (Human)
Description:
ChEMBL_1448917
Residue:
524
  
Inhibitor
Name:
BDBM76243
Synonyms:
1-(4-methylphenyl)sulfonyl-N-(4-propan-2-ylphenyl)-4-piperidinecarboxamide MLS002162172 SMR001244582 | cid_4786721
Type:
Small organic molecule
Emp. Form.:
C22H28N2O3S
Mol. Mass.:
400.534
SMILES:
CC(C)c1ccc(NC(=O)C2CCN(CC2)S(=O)(=O)c2ccc(C)cc2)cc1
: