Target
Sentrin-specific protease 6
Ligand
BDBM76446
Substrate
Meas. Tech.
Dose Response confirmation of uHTS for inhibitors of Sentrin-specific protease 6 (SENP6) using a Luminescent assay
IC50
>100000±n/a nM
Citation
 PubChem, PC Dose Response confirmation of uHTS for inhibitors of Sentrin-specific protease 6 (SENP6) using a Luminescent assay PubChem Bioassay (2010)[AID] 
Target
Name:
Sentrin-specific protease 6
Synonyms:
KIAA0797 SENP6_HUMAN SUMO-1-specific protease Sentrin-specific protease 6 (SENP6)
Type:
Enzyme Catalytic Domain
Mol. Mass.:
126147.68
Organism:
Homo sapiens (Human)
Description:
Q9GZR1
Residue:
1112
  
Inhibitor
Name:
BDBM76446
Synonyms:
(2-chlorobenzyl)-[2-(2,3-dihydro-1,4-benzodioxin-6-yl)-3-hydroxy-5-nitro-triazol-4-ylidene]amine N-(2-chlorobenzyl)-2-(2,3-dihydro-1,4-benzodioxin-6-yl)-5-nitro-2H-1,2,3-triazol-4-amine 3-oxide N-[(2-chlorophenyl)methyl]-2-(2,3-dihydro-1,4-benzodioxin-6-yl)-3-hydroxy-5-nitrotriazol-4-imine SMR000201342 | cid_2976293
Type:
Small organic molecule
Emp. Form.:
C17H14ClN5O5
Mol. Mass.:
403.777
SMILES:
On1n(nc([N+]([O-])=O)\c1=N/Cc1ccccc1Cl)-c1ccc2OCCOc2c1
: