Target
Sentrin-specific protease 6
Ligand
BDBM61741
Substrate
Meas. Tech.
Dose Response confirmation of uHTS for inhibitors of Sentrin-specific protease 6 (SENP6) using a Luminescent assay
IC50
1400±n/a nM
Citation
 PubChem, PC Dose Response confirmation of uHTS for inhibitors of Sentrin-specific protease 6 (SENP6) using a Luminescent assay PubChem Bioassay (2010)[AID] 
Target
Name:
Sentrin-specific protease 6
Synonyms:
KIAA0797 SENP6_HUMAN SUMO-1-specific protease Sentrin-specific protease 6 (SENP6)
Type:
Enzyme Catalytic Domain
Mol. Mass.:
126147.68
Organism:
Homo sapiens (Human)
Description:
Q9GZR1
Residue:
1112
  
Inhibitor
Name:
BDBM61741
Synonyms:
2-[(E)-2-(2-chlorophenyl)ethenyl]-1H-quinazolin-4-one MLS001173656 cid_5898073
Type:
Small organic molecule
Emp. Form.:
C16H11ClN2O
Mol. Mass.:
282.724
SMILES:
Clc1ccccc1C=Cc1nc2ccccc2c(=O)[nH]1
: