Target
Kappa-type opioid receptor
Ligand
BDBM71618
Substrate
Meas. Tech.
SAR analysis of Antagonists of the Kappa Opioid Receptor (KOR) using an Image-Based Assay - Set 4
IC50
490±n/a nM
Citation
 PubChem, PC SAR analysis of Antagonists of the Kappa Opioid Receptor (KOR) using an Image-Based Assay - Set 4 PubChem Bioassay (2010)[AID] 
Target
Name:
Kappa-type opioid receptor
Synonyms:
K-OR-1 Kappa-opioid receptor (KOR) Kappa-type opioid receptor (KOR) OPIATE Kappa OPRK1 kappa opioid receptor (KOR)
Type:
G Protein-Coupled Receptor (GPCR)
Mol. Mass.:
42648.76
Organism:
Homo sapiens (Human)
Description:
P41145
Residue:
380
  
Inhibitor
Name:
BDBM71618
Synonyms:
KSC-1-272 cid_44828478
Type:
Small organic molecule
Emp. Form.:
C27H32N6O4
Mol. Mass.:
504.5808
SMILES:
COc1ccc(N2CCN(CCCNC(=O)Cn3c4ncccc4n4cccc4c3=O)CC2)c(OC)c1
: