Target
Kappa-type opioid receptor
Ligand
BDBM75570
Substrate
Meas. Tech.
SAR analysis of Antagonists of the Kappa Opioid Receptor (KOR) using an Image-Based Assay - Set 4
IC50
2250±n/a nM
Citation
 PubChem, PC SAR analysis of Antagonists of the Kappa Opioid Receptor (KOR) using an Image-Based Assay - Set 4 PubChem Bioassay (2010)[AID] 
Target
Name:
Kappa-type opioid receptor
Synonyms:
K-OR-1 Kappa-opioid receptor (KOR) Kappa-type opioid receptor (KOR) OPIATE Kappa OPRK1 kappa opioid receptor (KOR)
Type:
G Protein-Coupled Receptor (GPCR)
Mol. Mass.:
42648.76
Organism:
Homo sapiens (Human)
Description:
P41145
Residue:
380
  
Inhibitor
Name:
BDBM75570
Synonyms:
KSC-11-128-1 N-[2-[(phenylmethyl)-propan-2-yl-amino]ethyl]-4-[[(4-propylphenyl)sulfonylamino]methyl]benzamide N-[2-[benzyl(isopropyl)amino]ethyl]-4-[[(4-propylphenyl)sulfonylamino]methyl]benzamide cid_45115590
Type:
Small organic molecule
Emp. Form.:
C29H37N3O3S
Mol. Mass.:
507.687
SMILES:
CCCc1ccc(cc1)S(=O)(=O)NCc1ccc(cc1)C(=O)NCCN(Cc1ccccc1)C(C)C
: