Target
Kappa-type opioid receptor
Ligand
BDBM75576
Substrate
Meas. Tech.
SAR analysis of Antagonists of the Kappa Opioid Receptor (KOR) using an Image-Based Assay - Set 4
IC50
>32000±n/a nM
Citation
 PubChem, PC SAR analysis of Antagonists of the Kappa Opioid Receptor (KOR) using an Image-Based Assay - Set 4 PubChem Bioassay (2010)[AID] 
Target
Name:
Kappa-type opioid receptor
Synonyms:
K-OR-1 Kappa-opioid receptor (KOR) Kappa-type opioid receptor (KOR) OPIATE Kappa OPRK1 kappa opioid receptor (KOR)
Type:
G Protein-Coupled Receptor (GPCR)
Mol. Mass.:
42648.76
Organism:
Homo sapiens (Human)
Description:
P41145
Residue:
380
  
Inhibitor
Name:
BDBM75576
Synonyms:
4-[[(4-methylphenyl)sulfonylamino]methyl]-N-[1-(phenylmethyl)-3-piperidinyl]benzamide KSC-11-136-1 N-(1-benzyl-3-piperidyl)-4-[(tosylamino)methyl]benzamide cid_45479165
Type:
Small organic molecule
Emp. Form.:
C27H31N3O3S
Mol. Mass.:
477.618
SMILES:
Cc1ccc(cc1)S(=O)(=O)NCc1ccc(cc1)C(=O)NC1CCCN(Cc2ccccc2)C1
: