Target
G-protein coupled receptor 35
Ligand
BDBM75864
Substrate
Meas. Tech.
SAR Analysis for the identification of Selective Antagonists of ERK1/2 Activity in GPR35-Overexpressing U2OS Cells - Set 2
IC50
1690±168.1 nM
Citation
 PubChem, PC SAR Analysis for the identification of Selective Antagonists of ERK1/2 Activity in GPR35-Overexpressing U2OS Cells - Set 2 PubChem Bioassay (2010)[AID] 
Target
Name:
G-protein coupled receptor 35
Synonyms:
G protein-coupled receptor 35 GPR35_HUMAN
Type:
Enzyme Catalytic Domain
Mol. Mass.:
34085.57
Organism:
Homo sapiens (Human)
Description:
gi_33695097
Residue:
309
  
Inhibitor
Name:
BDBM75864
Synonyms:
5-[(E)-[(4-chlorophenyl)thiocarbamoylhydrazono]methyl]-1-(2,4-difluorophenyl)pyrazole-4-carboxylic acid methyl ester MLS-0437443.0001 methyl 1-[2,4-bis(fluoranyl)phenyl]-5-[(E)-[(4-chlorophenyl)carbamothioylhydrazinylidene]methyl]pyrazole-4-carboxylate | methyl 5-[(E)-[(4-chlorophenyl)carbamothioylhydrazinylidene]methyl]-1-(2,4-difluorophenyl)pyrazole-4-carboxylate
Type:
Small organic molecule
Emp. Form.:
C19H14ClF2N5O2S
Mol. Mass.:
449.862
SMILES:
COC(=O)c1cnn(c1C=NNC(=S)Nc1ccc(Cl)cc1)-c1ccc(F)cc1F
: