Target
Voltage-dependent T-type calcium channel subunit alpha-1H
Ligand
BDBM76802
Substrate
Meas. Tech.
Inhibitors of T-Type Calcium Channel
EC50
6400±0 nM
Citation
 PubChem, PC Inhibitors of T-Type Calcium Channel PubChem Bioassay (2010)[AID] 
Target
Name:
Voltage-dependent T-type calcium channel subunit alpha-1H
Synonyms:
CAC1H_HUMAN Low-voltage-activated calcium channel alpha1 3.2 subunit Voltage-gated calcium channel voltage-dependent T-type calcium channel subunit alpha-1H isoform a
Type:
Enzyme Catalytic Domain
Mol. Mass.:
259187.68
Organism:
Homo sapiens (Human)
Description:
Calcium channel (Type T,L) 0 0::O95180
Residue:
2353
  
Inhibitor
Name:
BDBM76802
Synonyms:
2-[4-(3-Methoxy-phenyl)-piperazin-1-yl]-N-(5-phenyl-[1,3,4]thiadiazol-2-yl)-acetamide 2-[4-(3-methoxyphenyl)piperazin-1-yl]-N-(5-phenyl-1,3,4-thiadiazol-2-yl)acetamide 2-[4-(3-methoxyphenyl)piperazino]-N-(5-phenyl-1,3,4-thiadiazol-2-yl)acetamide SMR000005370 | cid_645405
Type:
Small organic molecule
Emp. Form.:
C21H23N5O2S
Mol. Mass.:
409.505
SMILES:
COc1cccc(c1)N1CCN(CC(=O)Nc2nnc(s2)-c2ccccc2)CC1
: