Target
Voltage-dependent T-type calcium channel subunit alpha-1H
Ligand
BDBM76841
Substrate
Meas. Tech.
Inhibitors of T-Type Calcium Channel
EC50
2530±0 nM
Citation
 PubChem, PC Inhibitors of T-Type Calcium Channel PubChem Bioassay (2010)[AID] 
Target
Name:
Voltage-dependent T-type calcium channel subunit alpha-1H
Synonyms:
CAC1H_HUMAN Low-voltage-activated calcium channel alpha1 3.2 subunit Voltage-gated calcium channel voltage-dependent T-type calcium channel subunit alpha-1H isoform a
Type:
Enzyme Catalytic Domain
Mol. Mass.:
259187.68
Organism:
Homo sapiens (Human)
Description:
Calcium channel (Type T,L) 0 0::O95180
Residue:
2353
  
Inhibitor
Name:
BDBM76841
Synonyms:
2-[[5-[(3-chloroanilino)methyl]-4-methyl-1,2,4-triazol-3-yl]thio]acetic acid cyclohexyl ester SMR000001677 cyclohexyl 2-[[5-[(3-chloroanilino)methyl]-4-methyl-1,2,4-triazol-3-yl]sulfanyl]acetate {5-[(3-Chloro-phenylamino)-methyl]-4-methyl-4H-[1,2,4]triazol-3-ylsulfanyl}-acetic acid cyclohexyl ester
Type:
Small organic molecule
Emp. Form.:
C18H23ClN4O2S
Mol. Mass.:
394.919
SMILES:
Cn1c(CNc2cccc(Cl)c2)nnc1SCC(=O)OC1CCCCC1
: