Target
Voltage-dependent T-type calcium channel subunit alpha-1H
Ligand
BDBM76867
Substrate
Meas. Tech.
Inhibitors of T-Type Calcium Channel
EC50
8310±0 nM
Citation
 PubChem, PC Inhibitors of T-Type Calcium Channel PubChem Bioassay (2010)[AID] 
Target
Name:
Voltage-dependent T-type calcium channel subunit alpha-1H
Synonyms:
CAC1H_HUMAN Low-voltage-activated calcium channel alpha1 3.2 subunit Voltage-gated calcium channel voltage-dependent T-type calcium channel subunit alpha-1H isoform a
Type:
Enzyme Catalytic Domain
Mol. Mass.:
259187.68
Organism:
Homo sapiens (Human)
Description:
Calcium channel (Type T,L) 0 0::O95180
Residue:
2353
  
Inhibitor
Name:
BDBM76867
Synonyms:
2,5-dimethyl-1-(phenothiazine-10-carbonyl)-4-piperidone 2,5-dimethyl-1-[oxo(10-phenothiazinyl)methyl]-4-piperidinone MLS000078453 cid_658955
Type:
Small organic molecule
Emp. Form.:
C20H20N2O2S
Mol. Mass.:
352.45
SMILES:
CC1CC(=O)C(C)CN1C(=O)N1c2ccccc2Sc2ccccc12
: