Target
Voltage-dependent T-type calcium channel subunit alpha-1H
Ligand
BDBM46002
Substrate
Meas. Tech.
Inhibitors of T-Type Calcium Channel
EC50
7240±0 nM
Citation
 PubChem, PC Inhibitors of T-Type Calcium Channel PubChem Bioassay (2010)[AID] 
Target
Name:
Voltage-dependent T-type calcium channel subunit alpha-1H
Synonyms:
CAC1H_HUMAN Low-voltage-activated calcium channel alpha1 3.2 subunit Voltage-gated calcium channel voltage-dependent T-type calcium channel subunit alpha-1H isoform a
Type:
Enzyme Catalytic Domain
Mol. Mass.:
259187.68
Organism:
Homo sapiens (Human)
Description:
Calcium channel (Type T,L) 0 0::O95180
Residue:
2353
  
Inhibitor
Name:
BDBM46002
Synonyms:
(6-methyl-2-pyridyl)-[4-(2-pyridyl)thiazol-2-yl]amine N-(6-methyl-2-pyridinyl)-4-(2-pyridinyl)-2-thiazolamine cid_972317
Type:
Small organic molecule
Emp. Form.:
C14H12N4S
Mol. Mass.:
268.337
SMILES:
Cc1cccc(Nc2nc(cs2)-c2ccccn2)n1
: