Target
Voltage-dependent T-type calcium channel subunit alpha-1H
Ligand
BDBM77000
Substrate
Meas. Tech.
Inhibitors of T-Type Calcium Channel
EC50
8070±0 nM
Citation
 PubChem, PC Inhibitors of T-Type Calcium Channel PubChem Bioassay (2010)[AID] 
Target
Name:
Voltage-dependent T-type calcium channel subunit alpha-1H
Synonyms:
CAC1H_HUMAN Low-voltage-activated calcium channel alpha1 3.2 subunit Voltage-gated calcium channel voltage-dependent T-type calcium channel subunit alpha-1H isoform a
Type:
Enzyme Catalytic Domain
Mol. Mass.:
259187.68
Organism:
Homo sapiens (Human)
Description:
Calcium channel (Type T,L) 0 0::O95180
Residue:
2353
  
Inhibitor
Name:
BDBM77000
Synonyms:
3-[5-(2-biphenylyl)-1,2,4-oxadiazol-3-yl]pyridine 5-(2-phenylphenyl)-3-(3-pyridyl)-1,2,4-oxadiazole MLS000063573 cid_976211
Type:
Small organic molecule
Emp. Form.:
C19H13N3O
Mol. Mass.:
299.326
SMILES:
c1ccc(cc1)-c1ccccc1-c1nc(no1)-c1cccnc1
: