Target
Voltage-dependent T-type calcium channel subunit alpha-1H
Ligand
BDBM37163
Substrate
Meas. Tech.
Inhibitors of T-Type Calcium Channel
EC50
1330±0 nM
Citation
 PubChem, PC Inhibitors of T-Type Calcium Channel PubChem Bioassay (2010)[AID] 
Target
Name:
Voltage-dependent T-type calcium channel subunit alpha-1H
Synonyms:
CAC1H_HUMAN Low-voltage-activated calcium channel alpha1 3.2 subunit Voltage-gated calcium channel voltage-dependent T-type calcium channel subunit alpha-1H isoform a
Type:
Enzyme Catalytic Domain
Mol. Mass.:
259187.68
Organism:
Homo sapiens (Human)
Description:
Calcium channel (Type T,L) 0 0::O95180
Residue:
2353
  
Inhibitor
Name:
BDBM37163
Synonyms:
MLS000119027 N-(5-bromo-1,3-thiazol-2-yl)-3-phenyl-2-pyrrol-1-ylpropanamide N-(5-bromothiazol-2-yl)-3-phenyl-2-pyrrol-1-yl-propionamide cid_5308071
Type:
Small organic molecule
Emp. Form.:
C16H14BrN3OS
Mol. Mass.:
376.271
SMILES:
Brc1cnc(NC(=O)C(Cc2ccccc2)n2cccc2)s1
: