Target
Voltage-dependent T-type calcium channel subunit alpha-1H
Ligand
BDBM77212
Substrate
Meas. Tech.
Inhibitors of T-Type Calcium Channel
EC50
4590±0 nM
Citation
 PubChem, PC Inhibitors of T-Type Calcium Channel PubChem Bioassay (2010)[AID] 
Target
Name:
Voltage-dependent T-type calcium channel subunit alpha-1H
Synonyms:
CAC1H_HUMAN Low-voltage-activated calcium channel alpha1 3.2 subunit Voltage-gated calcium channel voltage-dependent T-type calcium channel subunit alpha-1H isoform a
Type:
Enzyme Catalytic Domain
Mol. Mass.:
259187.68
Organism:
Homo sapiens (Human)
Description:
Calcium channel (Type T,L) 0 0::O95180
Residue:
2353
  
Inhibitor
Name:
BDBM77212
Synonyms:
1-benzyl-N-phenyl-5-[(2,2,2-trifluoroacetyl)amino]triazole-4-carboxamide N-phenyl-1-(phenylmethyl)-5-[(2,2,2-trifluoro-1-oxoethyl)amino]-4-triazolecarboxamide SMR000130016 | cid_1265416
Type:
Small organic molecule
Emp. Form.:
C18H14F3N5O2
Mol. Mass.:
389.3313
SMILES:
FC(F)(F)C(=O)Nc1c(nnn1Cc1ccccc1)C(=O)Nc1ccccc1
: