Target
Voltage-dependent T-type calcium channel subunit alpha-1H
Ligand
BDBM77326
Substrate
Meas. Tech.
Inhibitors of T-Type Calcium Channel
EC50
558±0 nM
Citation
 PubChem, PC Inhibitors of T-Type Calcium Channel PubChem Bioassay (2010)[AID] 
Target
Name:
Voltage-dependent T-type calcium channel subunit alpha-1H
Synonyms:
CAC1H_HUMAN Low-voltage-activated calcium channel alpha1 3.2 subunit Voltage-gated calcium channel voltage-dependent T-type calcium channel subunit alpha-1H isoform a
Type:
Enzyme Catalytic Domain
Mol. Mass.:
259187.68
Organism:
Homo sapiens (Human)
Description:
Calcium channel (Type T,L) 0 0::O95180
Residue:
2353
  
Inhibitor
Name:
BDBM77326
Synonyms:
(2-anilino-2-oxoethyl) (2S)-2-[[3-(diethylsulfamoyl)benzoyl]amino]-3-methylbutanoate (2S)-2-[[3-(diethylsulfamoyl)benzoyl]amino]-3-methyl-butyric acid (2-anilino-2-keto-ethyl) ester MLS000570373 cid_9552018
Type:
Small organic molecule
Emp. Form.:
C24H31N3O6S
Mol. Mass.:
489.584
SMILES:
CCN(CC)S(=O)(=O)c1cccc(c1)C(=O)N[C@@H](C(C)C)C(=O)OCC(=O)Nc1ccccc1
: