Target
Voltage-dependent T-type calcium channel subunit alpha-1H
Ligand
BDBM53772
Substrate
Meas. Tech.
Inhibitors of T-Type Calcium Channel
EC50
1210±0 nM
Citation
 PubChem, PC Inhibitors of T-Type Calcium Channel PubChem Bioassay (2010)[AID] 
Target
Name:
Voltage-dependent T-type calcium channel subunit alpha-1H
Synonyms:
CAC1H_HUMAN Low-voltage-activated calcium channel alpha1 3.2 subunit Voltage-gated calcium channel voltage-dependent T-type calcium channel subunit alpha-1H isoform a
Type:
Enzyme Catalytic Domain
Mol. Mass.:
259187.68
Organism:
Homo sapiens (Human)
Description:
Calcium channel (Type T,L) 0 0::O95180
Residue:
2353
  
Inhibitor
Name:
BDBM53772
Synonyms:
2-[(2-{[(2-fluorophenyl)sulfonyl]amino}phenyl)sulfanyl]-N-[5-(trifluoromethyl)-1,3,4-thiadiazol-2-yl]acetamide 2-[2-[(2-fluorophenyl)sulfonylamino]phenyl]sulfanyl-N-[5-(trifluoromethyl)-1,3,4-thiadiazol-2-yl]ethanamide MLS000331332 cid_4364115
Type:
Small organic molecule
Emp. Form.:
C17H12F4N4O3S3
Mol. Mass.:
492.491
SMILES:
Fc1ccccc1S(=O)(=O)Nc1ccccc1SCC(=O)Nc1nnc(s1)C(F)(F)F
: