Target
Protein RecA
Ligand
BDBM66855
Substrate
Meas. Tech.
Intein inhibitors as potential Tuberculosis drugs
IC50
53540±n/a nM
Citation
 PubChem, PC Intein inhibitors as potential Tuberculosis drugs PubChem Bioassay (2010)[AID] 
Target
Name:
Protein RecA
Synonyms:
DNA recombination protein RecA recA
Type:
Enzyme Catalytic Domain
Mol. Mass.:
85386.52
Organism:
Mycobacterium tuberculosis H37Rv
Description:
gi_15609874
Residue:
790
  
Inhibitor
Name:
BDBM66855
Synonyms:
5-chloranyl-2-[(4-methylphenyl)methylsulfonyl]-N-(5-propan-2-yl-1,3,4-thiadiazol-2-yl)pyrimidine-4-carboxamide 5-chloro-2-[(4-methylphenyl)methylsulfonyl]-N-(5-propan-2-yl-1,3,4-thiadiazol-2-yl)pyrimidine-4-carboxamide MLS001116157 cid_16014341
Type:
Small organic molecule
Emp. Form.:
C18H18ClN5O3S2
Mol. Mass.:
451.95
SMILES:
CC(C)c1nnc(NC(=O)c2nc(ncc2Cl)S(=O)(=O)Cc2ccc(C)cc2)s1
: