Target
Caspase-7
Ligand
BDBM63168
Substrate
Meas. Tech.
Counterscreen for procaspase-3 activators: absorbance-based biochemical high throughput dose response assay for activators of procaspase-7
EC50
>85267±n/a nM
Citation
 PubChem, PC Counterscreen for procaspase-3 activators: absorbance-based biochemical high throughput dose response assay for activators of procaspase-7 PubChem Bioassay (2010)[AID] 
Target
Name:
Caspase-7
Synonyms:
Apoptotic protease Mch-3 CASP7 CMH-1 MCH3 | caspase 7, apoptosis-related cysteine peptidase
Type:
Enzyme
Mol. Mass.:
34273.91
Organism:
Homo sapiens (Human)
Description:
P55210
Residue:
303
  
Inhibitor
Name:
BDBM63168
Synonyms:
4-methyl-2-[[(Z)-(2-oxidanylidenenaphthalen-1-ylidene)methyl]amino]-5-(phenylmethyl)thiophene-3-carboxamide 5-Benzyl-2-[(2-hydroxy-naphthalen-1-ylmethylene)-amino]-4-methyl-thiophene-3-carboxylic acid amide 5-benzyl-4-methyl-2-[[(Z)-(2-oxonaphthalen-1-ylidene)methyl]amino]thiophene-3-carboxamide SMR000171736 | cid_5432072
Type:
Small organic molecule
Emp. Form.:
C24H20N2O2S
Mol. Mass.:
400.493
SMILES:
Cc1c(Cc2ccccc2)sc(N=Cc2c(O)ccc3ccccc23)c1C(N)=O
: