Target
Caspase-3
Ligand
BDBM33057
Substrate
Meas. Tech.
Absorbance-based biochemical high throughput dose response assay for activators of procaspase-3
EC50
>85212±n/a nM
Citation
 PubChem, PC Absorbance-based biochemical high throughput dose response assay for activators of procaspase-3 PubChem Bioassay (2010)[AID] 
Target
Name:
Caspase-3
Synonyms:
Apopain CASP3 CPP-32 Caspase 3 Caspase-3 subunit p17 SCA-1 Yama protein | caspase-3 preproprotein
Type:
Hydrolase; heterotetramer of two heterodimers
Mol. Mass.:
31607.55
Organism:
Homo sapiens (Human)
Description:
Residue:
277
  
Inhibitor
Name:
BDBM33057
Synonyms:
6-methyl-2-(1-naphthalenyl)-5-benzotriazolamine 6-methyl-2-naphthalen-1-yl-benzotriazol-5-amine MLS000064228 [6-methyl-2-(1-naphthyl)benzotriazol-5-yl]amine | cid_938026
Type:
Small organic molecule
Emp. Form.:
C17H14N4
Mol. Mass.:
274.3199
SMILES:
Cc1cc2nn(nc2cc1N)-c1cccc2ccccc12
: