Target
Caspase-3
Ligand
BDBM77499
Substrate
Meas. Tech.
Absorbance-based biochemical high throughput dose response assay for activators of procaspase-3
EC50
3540±n/a nM
Citation
 PubChem, PC Absorbance-based biochemical high throughput dose response assay for activators of procaspase-3 PubChem Bioassay (2010)[AID] 
Target
Name:
Caspase-3
Synonyms:
Apopain CASP3 CPP-32 Caspase 3 Caspase-3 subunit p17 SCA-1 Yama protein | caspase-3 preproprotein
Type:
Hydrolase; heterotetramer of two heterodimers
Mol. Mass.:
31607.55
Organism:
Homo sapiens (Human)
Description:
Residue:
277
  
Inhibitor
Name:
BDBM77499
Synonyms:
2-(2-Methoxy-phenylamino)-8-methyl-quinoline-3-carbonitrile 2-(2-methoxyanilino)-8-methylquinoline-3-carbonitrile 8-methyl-2-(o-anisidino)quinoline-3-carbonitrile SMR000172503 | cid_865262
Type:
Small organic molecule
Emp. Form.:
C18H15N3O
Mol. Mass.:
289.3312
SMILES:
COc1ccccc1Nc1nc2c(C)cccc2cc1C#N
: