Target
Caspase-3
Ligand
BDBM77500
Substrate
Meas. Tech.
Absorbance-based biochemical high throughput dose response assay for activators of procaspase-3
EC50
>85247±n/a nM
Citation
 PubChem, PC Absorbance-based biochemical high throughput dose response assay for activators of procaspase-3 PubChem Bioassay (2010)[AID] 
Target
Name:
Caspase-3
Synonyms:
Apopain CASP3 CPP-32 Caspase 3 Caspase-3 subunit p17 SCA-1 Yama protein | caspase-3 preproprotein
Type:
Hydrolase; heterotetramer of two heterodimers
Mol. Mass.:
31607.55
Organism:
Homo sapiens (Human)
Description:
Residue:
277
  
Inhibitor
Name:
BDBM77500
Synonyms:
2-(2,5-dimethyl-N-methylsulfonylanilino)-N-[4-(6-methyl-1,3-benzothiazol-2-yl)phenyl]acetamide 2-[(2,5-dimethylphenyl)-methylsulfonyl-amino]-N-[4-(6-methyl-1,3-benzothiazol-2-yl)phenyl]ethanamide N~2~-(2,5-dimethylphenyl)-N~1~-[4-(6-methyl-1,3-benzothiazol-2-yl)phenyl]-N~2~-(methylsulfonyl)glycinamide cid_1337930
Type:
Small organic molecule
Emp. Form.:
C25H25N3O3S2
Mol. Mass.:
479.614
SMILES:
Cc1ccc(C)c(c1)N(CC(=O)Nc1ccc(cc1)-c1nc2ccc(C)cc2s1)S(C)(=O)=O
: