Target
Caspase-3
Ligand
BDBM77502
Substrate
Meas. Tech.
Absorbance-based biochemical high throughput dose response assay for activators of procaspase-3
EC50
>9475±n/a nM
Citation
 PubChem, PC Absorbance-based biochemical high throughput dose response assay for activators of procaspase-3 PubChem Bioassay (2010)[AID] 
Target
Name:
Caspase-3
Synonyms:
Apopain CASP3 CPP-32 Caspase 3 Caspase-3 subunit p17 SCA-1 Yama protein | caspase-3 preproprotein
Type:
Hydrolase; heterotetramer of two heterodimers
Mol. Mass.:
31607.55
Organism:
Homo sapiens (Human)
Description:
Residue:
277
  
Inhibitor
Name:
BDBM77502
Synonyms:
4-Methyl-N-[4-(6-methyl-benzothiazol-2-yl)-phenyl]-benzenesulfonamide MLS000587794 cid_1239093
Type:
Small organic molecule
Emp. Form.:
C21H18N2O2S2
Mol. Mass.:
394.51
SMILES:
Cc1ccc(cc1)S(=O)(=O)Nc1ccc(cc1)-c1nc2ccc(C)cc2s1
: