Target
RecBCD enzyme subunit RecD
Ligand
BDBM77549
Substrate
Meas. Tech.
Counterscreen for AddAB inhibitors: absorbance-based bacterial cell-based high throughput dose response assay to identify inhibitors of RecBCD
IC50
>39503±n/a nM
Citation
 PubChem, PC Counterscreen for AddAB inhibitors: absorbance-based bacterial cell-based high throughput dose response assay to identify inhibitors of RecBCD PubChem Bioassay (2010)[AID] 
Target
Name:
RecBCD enzyme subunit RecD
Synonyms:
RECD_ECOLI hopE | recD
Type:
Enzyme Catalytic Domain
Mol. Mass.:
66906.68
Organism:
Escherichia coli str. K-12 substr. MG1655
Description:
gi_16130723
Residue:
608
  
Inhibitor
Name:
BDBM77549
Synonyms:
5-nitro-N-(2-pyrimidinyl)-2-furancarboxamide 5-nitro-N-pyrimidin-2-yl-furan-2-carboxamide MLS000766077 cid_771978
Type:
Small organic molecule
Emp. Form.:
C9H6N4O4
Mol. Mass.:
234.1683
SMILES:
[O-][N+](=O)c1ccc(o1)C(=O)Nc1ncccn1
: