Target
RecBCD enzyme subunit RecD
Ligand
BDBM64703
Substrate
Meas. Tech.
Counterscreen for AddAB inhibitors: absorbance-based bacterial cell-based high throughput dose response assay to identify inhibitors of RecBCD
IC50
102019±n/a nM
Citation
 PubChem, PC Counterscreen for AddAB inhibitors: absorbance-based bacterial cell-based high throughput dose response assay to identify inhibitors of RecBCD PubChem Bioassay (2010)[AID] 
Target
Name:
RecBCD enzyme subunit RecD
Synonyms:
RECD_ECOLI hopE | recD
Type:
Enzyme Catalytic Domain
Mol. Mass.:
66906.68
Organism:
Escherichia coli str. K-12 substr. MG1655
Description:
gi_16130723
Residue:
608
  
Inhibitor
Name:
BDBM64703
Synonyms:
7-[(2-chlorophenyl)-(1-pyrrolidinyl)methyl]-8-quinolinol 7-[(2-chlorophenyl)-pyrrolidin-1-ylmethyl]quinolin-8-ol MLS000761483 cid_5187118
Type:
Small organic molecule
Emp. Form.:
C20H19ClN2O
Mol. Mass.:
338.831
SMILES:
Oc1c(ccc2cccnc12)C(N1CCCC1)c1ccccc1Cl
: