Target
RecBCD enzyme subunit RecD
Ligand
BDBM60273
Substrate
Meas. Tech.
Counterscreen for AddAB inhibitors: absorbance-based bacterial cell-based high throughput dose response assay to identify inhibitors of RecBCD
IC50
>118488±n/a nM
Citation
 PubChem, PC Counterscreen for AddAB inhibitors: absorbance-based bacterial cell-based high throughput dose response assay to identify inhibitors of RecBCD PubChem Bioassay (2010)[AID] 
Target
Name:
RecBCD enzyme subunit RecD
Synonyms:
RECD_ECOLI hopE | recD
Type:
Enzyme Catalytic Domain
Mol. Mass.:
66906.68
Organism:
Escherichia coli str. K-12 substr. MG1655
Description:
gi_16130723
Residue:
608
  
Inhibitor
Name:
BDBM60273
Synonyms:
MLS000861866 N-phenyl-2-[(2-pyridin-2-yl-2,3-dihydro-1,3,4-thiadiazol-5-yl)sulfanyl]ethanamide N-phenyl-2-[[2-(2-pyridyl)-2,3-dihydro-1,3,4-thiadiazol-5-yl]thio]acetamide SMR000460650 | cid_2746659
Type:
Small organic molecule
Emp. Form.:
C15H14N4OS2
Mol. Mass.:
330.428
SMILES:
O=C(CSC1=NNC(S1)c1ccccn1)Nc1ccccc1
: