Target
Short transient receptor potential channel 4
Ligand
BDBM77623
Substrate
Meas. Tech.
SAR Analysis for the identification of selective inhibits of the transient receptor potential cation channel C4 (TRPC4): Automated Electrophysiology
IC50
5490±n/a nM
Citation
 PubChem, PC SAR Analysis for the identification of selective inhibits of the transient receptor potential cation channel C4 (TRPC4): Automated Electrophysiology PubChem Bioassay (2010)[AID] 
Target
Name:
Short transient receptor potential channel 4
Synonyms:
TRPC4_MOUSE Trrp4 | alternatively spliced Trp4
Type:
Enzyme Catalytic Domain
Mol. Mass.:
111587.67
Organism:
Mus musculus
Description:
Q9QUQ5
Residue:
974
  
Inhibitor
Name:
BDBM77623
Synonyms:
4,6-dimethyl-2-(1-piperidinyl)quinoline;2,2,2-trifluoroacetic acid 4,6-dimethyl-2-piperidin-1-ylquinoline;2,2,2-trifluoroacetic acid VU0419897-1 | cid_46891894
Type:
Small organic molecule
Emp. Form.:
C16H20N2
Mol. Mass.:
240.3434
SMILES:
Cc1ccc2nc(cc(C)c2c1)N1CCCCC1
: