Target
Voltage-dependent T-type calcium channel subunit alpha-1H
Ligand
BDBM32776
Substrate
Meas. Tech.
Inhibitors of T-Type Calcium Channels
EC50
1103±n/a nM
Citation
 PubChem, PC Inhibitors of T-Type Calcium Channels PubChem Bioassay (2011)[AID] 
Target
Name:
Voltage-dependent T-type calcium channel subunit alpha-1H
Synonyms:
CAC1H_HUMAN Low-voltage-activated calcium channel alpha1 3.2 subunit Voltage-gated calcium channel voltage-dependent T-type calcium channel subunit alpha-1H isoform a
Type:
Enzyme Catalytic Domain
Mol. Mass.:
259187.68
Organism:
Homo sapiens (Human)
Description:
Calcium channel (Type T,L) 0 0::O95180
Residue:
2353
  
Inhibitor
Name:
BDBM32776
Synonyms:
4-methoxy-N-(4-thiophen-2-yl-1,3-thiazol-2-yl)benzamide 4-methoxy-N-[4-(2-thienyl)thiazol-2-yl]benzamide SMR000062204 | cid_746912
Type:
Small organic molecule
Emp. Form.:
C15H12N2O2S2
Mol. Mass.:
316.398
SMILES:
COc1ccc(cc1)C(=O)Nc1nc(cs1)-c1cccs1
: