Target
Voltage-dependent T-type calcium channel subunit alpha-1H
Ligand
BDBM77448
Substrate
Meas. Tech.
Inhibitors of T-Type Calcium Channels
EC50
808±n/a nM
Citation
 PubChem, PC Inhibitors of T-Type Calcium Channels PubChem Bioassay (2011)[AID] 
Target
Name:
Voltage-dependent T-type calcium channel subunit alpha-1H
Synonyms:
CAC1H_HUMAN Low-voltage-activated calcium channel alpha1 3.2 subunit Voltage-gated calcium channel voltage-dependent T-type calcium channel subunit alpha-1H isoform a
Type:
Enzyme Catalytic Domain
Mol. Mass.:
259187.68
Organism:
Homo sapiens (Human)
Description:
Calcium channel (Type T,L) 0 0::O95180
Residue:
2353
  
Inhibitor
Name:
BDBM77448
Synonyms:
2-[(5-chloranylthiophen-2-yl)sulfonylamino]-N-phenyl-benzamide 2-[(5-chloro-2-thiophenyl)sulfonylamino]-N-phenylbenzamide 2-{[(5-chloro-2-thienyl)sulfonyl]amino}-N-phenylbenzamide SMR000199461 | cid_2200848
Type:
Small organic molecule
Emp. Form.:
C17H13ClN2O3S2
Mol. Mass.:
392.88
SMILES:
Clc1ccc(s1)S(=O)(=O)Nc1ccccc1C(=O)Nc1ccccc1
: