Target
Beta-secretase 1
Ligand
BDBM270567
Substrate
Meas. Tech.
BACE1 Binding Assay
pH
4.5±n/a
Temperature
298.15±n/a K
Ki
81.0±n/a nM
Comments
extracted
Citation
 Juhl, KTagmose, LMarigo, M 2-amino-3,5-difluoro-3,6-dimethyl-6-phenyl-3,4,5,6-tetrahydropyridines as BACE1 inhibitors for treating alzheimer's disease US Patent  US10059669 Publication Date 8/28/2018 
Target
Name:
Beta-secretase 1
Synonyms:
ASP2 Aspartyl protease 2 BACE1 Beta-secretase (BACE) Beta-secretase 1 (BACE 1) Beta-secretase 1 (BACE1) Beta-site amyloid precursor protein cleaving enzyme 1 Memapsin-2 beta-Secretase (BACE-1) | beta-Secretase (BACE1)
Type:
Protein
Mol. Mass.:
55755.10
Organism:
Homo sapiens (Human)
Description:
P56817
Residue:
501
  
Inhibitor
Name:
BDBM270567
Synonyms:
N-(3-((2R,3R,5S)-6-amino-3,5-difluoro-2,5-dimethyl-2,3,4,5-tetrahydropyridin-2-yl)-4-fluorophenyl)-5-(methoxy-d3)picolinamide | US10059669, Compound 23
Type:
Small organic molecule
Emp. Form.:
C20H21F3N4O2
Mol. Mass.:
406.4015
SMILES:
COc1ccc(nc1)C(=O)Nc1ccc(F)c(c1)[C@@]1(C)N=C(N)[C@@](C)(F)C[C@H]1F
: